Posts by tuxnet


    Danke für den guten TIP

    Guten morgen zusammen


    Der setup-0.3.1-zulu-edition macht unter easVDR leider eine menge Ärger. :evil:


    Mein System musste leider ein paar mal neu eingerichtet werden bis ich den Fehler finden konnte.


    Infos dazu gibt es in zwei Threads


    http://www.easy-vdr.de/forum/i…ic=3840.msg27484#msg27484
    http://www.easy-vdr.de/forum/index.php?topic=3806.75



    Das plugin schreibt die sysconfig so um, das easyVDR nach einem reboot nichts mehr damit anfangen kann.


    Es geht soweit, das man keinen Netzwerk Zugriff mehr hat ( ssh / ftp etc. ) noch eine Locale Konsole nutzen kann und sogar die Lirc funktioniert nicht.

    Bekomme unter easyVDR1.5.14extp45 folgende fehler


    Hunk #1 succeeded at 292 (offset 57 lines).
    Hunk #2 succeeded at 631 (offset 211 lines).
    Hunk #3 succeeded at 854 (offset 341 lines).
    patching file config.h
    Hunk #1 succeeded at 303 (offset 82 lines).
    patching file menu.c
    Hunk #1 FAILED at 2748.
    1 out of 1 hunk FAILED -- saving rejects to file menu.c.rej
    patching file po/de_DE.po
    Hunk #1 succeeded at 926 with fuzz 2 (offset 175 lines).
    patching file recording.c
    Hunk #1 succeeded at 26 with fuzz 2 (offset 3 lines).
    Hunk #2 FAILED at 710.
    Hunk #3 FAILED at 731.
    Hunk #4 FAILED at 1291.
    3 out of 4 hunks FAILED -- saving rejects to file recording.c.rej
    patching file recording.h
    Hunk #2 FAILED at 90.
    1 out of 2 hunks FAILED -- saving rejects to file recording.h.rej
    patching file svdrp.c
    Hunk #1 succeeded at 1065 (offset 4 lines).



    Welche TV Karte(n) hast du eingebaut ?

    Leider bekomme ich unter EASYvdr-1.4.7extp41 folgende Fehlermeldung


    menucontrol.h:34: error: ISO C++ forbids declaration of 'cSkinDisplayReplay' with no type
    menucontrol.h:34: error: expected ';' before '*' token
    menucontrol.h:41: error: 'eOSState' does not name a type
    menucontrol.h:51: error: ISO C++ forbids declaration of 'cSkinDisplayReplay' with no type
    menucontrol.h:51: error: expected ';' before '*' token
    menucontrol.h:65: error: 'eKeys' has not been declared
    menucontrol.h:71: error: 'eOSState' does not name a type
    psdcontrol.h:47: error: 'eOSState' does not name a type
    psdcontrol.h:69: error: 'eOSState' does not name a type
    psd.h:32: error: expected class-name before '{' token
    psd.h:36: error: 'eOSState' does not name a type
    psd.h:37: error: 'eOSState' does not name a type
    psd.h:41: error: 'eOSState' does not name a type
    setup.h:42: error: expected class-name before '{' token
    setup.h:42: warning: 'class cVcdSetupMenu' has virtual functions but non-virtual destructor
    vcd.c:39: error: expected class-name before '{' token
    vcd.c:53: error: ISO C++ forbids declaration of 'cOsdMenu' with no type
    vcd.c:53: error: 'cOsdMenu' declared as a 'virtual' field
    vcd.c:53: error: expected ';' before '*' token
    vcd.c:54: error: ISO C++ forbids declaration of 'cMenuSetupPage' with no type
    vcd.c:54: error: 'cMenuSetupPage' declared as a 'virtual' field
    vcd.c:54: error: expected ';' before '*' token
    vcd.c: In member function 'virtual const char* cPluginVcd::Description()':
    vcd.c:73: error: 'asprintf' was not declared in this scope
    vcd.c: In member function 'virtual bool cPluginVcd::Start()':
    vcd.c:103: error: 'Phrases' was not declared in this scope
    vcd.c:103: error: 'RegisterI18n' was not declared in this scope
    vcd.c: In member function 'virtual const char* cPluginVcd::MainMenuEntry()':
    vcd.c:122: error: 'tr' was not declared in this scope
    vcd.c:122: error: 'asprintf' was not declared in this scope
    vcd.c:125: error: 'tr' was not declared in this scope
    vcd.c: At global scope:
    vcd.c:130: error: expected constructor, destructor, or type conversion before '*' token
    vcd.c:186: error: expected constructor, destructor, or type conversion before '*' token
    vcd.c: In member function 'virtual bool cPluginVcd::SetupParse(const char*, const char*)':
    vcd.c:193: error: 'strcasecmp' was not declared in this scope
    vcd.c: At global scope:
    vcd.c:210: error: expected constructor, destructor, or type conversion before ';' token
    make[1]: *** [vcd.o] Fehler 1
    make[1]: Leaving

    Quote

    Original von amair
    Hallo tuxnet!



    Du scheinst das Makefile vom EnigmaNG angeschaut zu haben. Ich meinte die Make.config im VDR-Verzeichnis.


    Gruß,
    Andreas


    Sorry, mein Fehler.


    Hier der Auszug


    # SKINENIGMA
    # ----------------------------------------------------------------------------
    SKINENIGMA_HAVE_EPGSEARCH = 1
    HAVE_IMAGEMAGICK = 1
    #SKINENIGMA_USE_PLUGIN_MAILBOX = 1
    SKINENIGMA_FONTS = /etc/vdr/plugins/skinenigmang/fonts
    # comment this out if you don't want to use FreeType font rendering.
    ifeq (exists, $(shell test `which freetype-config 2>/dev/null` && echo exists))
    HAVE_FREETYPE = 1
    endif
    #HAVE_FREETYPE = 1

    Morgen amair.


    Ich habe mich bereits mit prudentis unterhalten.


    Bei ihm läuft das Kompilieren ohne Probleme durch.
    Er nutzt wie ich ebenfalls EASYvdr.


    Der unterschied ist nur, ich nutze extp.40......er extp.37



    Ja, zwei Einträge


    #SKINENIGMA_FONTS = "\"Test Font\", \"Test2 Font\""


    DEFINES += -DSKINENIGMA_FONTS=$(SKINENIGMA_FONTS)

    Aus einem mir nicht bekannten Grund, funktioniert das plugin nichtmehr bei mir :(


    FRITZ!Box Firmware : v29.04.34 und das gleiche bei der aktuellen 29.04.49


    Hier mal der LOGREAD


    logread -f
    Dec 22 19:13:08 (none) user.debug vdr: [9403] FritzBox: Waiting for a message.
    Dec 22 19:13:08 (none) user.debug vdr: [9403] fritzlistener.c: Exception - Host is not reachable.
    Dec 22 19:14:08 (none) user.debug vdr: [9403] FritzBox: Waiting for a message.
    Dec 22 19:14:08 (none) user.debug vdr: [9403] fritzlistener.c: Exception - Host is not reachable.

    Leider bekomme ich unter EASYvdr eine Fehlermeldung


    imlibrenderer/dvbrenderer/mpeg2encoder.c
    imlibrenderer/dvbrenderer/mpeg2encoder.c:29:23: error: swscale.h: Datei oder Verzeichnis nicht gefunden
    imlibrenderer/dvbrenderer/mpeg2encoder.c: In function 'mpeg_frame mpeg_draw(UINT8*)':
    imlibrenderer/dvbrenderer/mpeg2encoder.c:137: error: 'SwsContext' was not declared in this scope
    imlibrenderer/dvbrenderer/mpeg2encoder.c:137: error: 'convert_ctx' was not declared in this scope
    imlibrenderer/dvbrenderer/mpeg2encoder.c:138: error: 'SWS_BICUBIC' was not declared in this scope
    imlibrenderer/dvbrenderer/mpeg2encoder.c:138: error: 'sws_getContext' was not declared in this scope
    imlibrenderer/dvbrenderer/mpeg2encoder.c:140: error: 'sws_scale' was not declared in this scope
    imlibrenderer/dvbrenderer/mpeg2encoder.c:141: error: 'sws_freeContext' was not declared in this scope
    make[1]: *** [imlibrenderer/dvbrenderer/mpeg2encoder.o] Fehler 1
    make[1]: Leaving directory `/usr/local/src/vdr-1.4.7-shutdown-rewrite-extp40/PLUGINS/src/graphtft-0.1.16.alpha'


    *** failed plugins: graphtft



    Nutze VDR 1.47ext40